BDBM479500 ML300-based SC inhibitor 39
SMILES Clc1cccc(CN(C(=O)Cn2nnc3ccccc23)c2ccc(nc2)-c2cn[nH]c2)c1
InChI Key InChIKey=WCLFFPWYAFAVEX-UHFFFAOYSA-N
Data  2 IC50  2 EC50
  Tab Delimited (TSV)   2D SDfile   Computed 3D by Vconf -m prep SDfile
Find this compound or compounds like it in BindingDB:
Activity Spreadsheet -- Enzyme Inhibition Constant Data from BindingDB
Found 4 hits for monomerid = 479500
TargetReplicase polyprotein 1ab(Human SARS coronavirus (SARS-CoV) (Severe acute re...)
Cleveland Clinic
LigandPNGBDBM479500(ML300-based SC inhibitor 39)
Affinity DataIC50:  336nM. Assay description: The protease activity and subsequent 10-point IC50 curves were spectroscopically determined using a scaled down, end point assay adapted from a previ...
Ligand InfoPC cidPC sid
In DepthDetails ArticlePubMed
TargetReplicase polyprotein 1ab(2019-nCoV)
Cleveland Clinic
LigandPNGBDBM479500(ML300-based SC inhibitor 39)
Affinity DataEC50:  4.65E+3nM. Assay description: Confluent monolayers of Vero E6 ACE2 cells in 12-well plates were washed once with DMEM and infected with approximately 50 plaque forming units (PFUs...
Ligand InfoPC cidPC sid
In DepthDetails ArticlePubMed
TargetReplicase polyprotein 1ab(2019-nCoV)
Cleveland Clinic
LigandPNGBDBM479500(ML300-based SC inhibitor 39)
Affinity DataEC50:  3.81E+3nM. Assay description: Briefly, Vero E6 ACE2 cells were cultured in 96-well flat-bottom plates at a density of 2 × 104 cells per well. Following infection of the cells with...
Ligand InfoPC cidPC sid
In DepthDetails ArticlePubMed
TargetReplicase polyprotein 1ab(2019-nCoV)
Cleveland Clinic
LigandPNGBDBM479500(ML300-based SC inhibitor 39)
Affinity DataIC50:  333nM. Assay description: The protease activity and subsequent 10-point IC50 curves were spectroscopically determined using a scaled down, end point assay adapted from a previ...
Ligand InfoPC cidPC sid
In DepthDetails ArticlePubMed