BDBM479645 US10899735, No. 104
SMILES COc1nc(ccc1CNC[C@@H](O)CC(O)=O)-c1cccc(c1Cl)-c1cccc(c1Br)-c1ccc(CNC[C@@H](O)CC(O)=O)c(OC)n1
InChI Key InChIKey=CFPMBFWTRFMXTO-VXKWHMMOSA-N
Data  1 IC50
  Tab Delimited (TSV)   2D SDfile   Computed 3D by Vconf -m prep SDfile
Find this compound or compounds like it in BindingDB:
Activity Spreadsheet -- Enzyme Inhibition Constant Data from BindingDB
Found 1 hit for monomerid = 479645
TargetProgrammed cell death 1 ligand 1/2(Homo sapiens (Human))
Gilead Sciences
US Patent
LigandPNGBDBM479645(US10899735, No. 104)
Affinity DataIC50:  90nM. Assay description: Compounds were tested in biochemical protein-protein interaction assays to determine if they can specifically block the interaction between the extra...
Ligand InfoKEGGPC cidPC sid
In DepthDetails US Patent