BDBM479668 US10899735, No. 127
SMILES COc1nc(ccc1CNCCC(O)=O)-c1cccc(c1Cl)-c1cccc(c1Cl)-c1ccc(CNC[C@@H]2CCC(=O)N2)c(OC)n1
InChI Key InChIKey=UEICYSQRGYBSFJ-QFIPXVFZSA-N
Data  1 IC50
  Tab Delimited (TSV)   2D SDfile   Computed 3D by Vconf -m prep SDfile
Find this compound or compounds like it in BindingDB:
Activity Spreadsheet -- Enzyme Inhibition Constant Data from BindingDB
Found 1 hit for monomerid = 479668
TargetProgrammed cell death 1 ligand 1/2(Homo sapiens (Human))
Gilead Sciences
US Patent
LigandPNGBDBM479668(US10899735, No. 127)
Affinity DataIC50:  87nM. Assay description: Compounds were tested in biochemical protein-protein interaction assays to determine if they can specifically block the interaction between the extra...
Ligand InfoPC cidPC sid
In DepthDetails US Patent