BDBM483679 4-chloro-1-(4-((5- chloro-2- (trifluoromethyl)- benzyl)- (methyl)amino)- piperidine-1- carbonyl)-1H- pyrazole-3- carboxylic acid::US10927105, Ex 112::US11655217, Example 112
SMILES CN(Cc1cc(Cl)ccc1C(F)(F)F)C1CCN(CC1)C(=O)n1cc(Cl)c(n1)C(O)=O
InChI Key InChIKey=VTRQXEDUOVMRRT-UHFFFAOYSA-N
Data  4 IC50
  Tab Delimited (TSV)   2D SDfile   Computed 3D by Vconf -m prep SDfile
Find this compound or compounds like it in BindingDB:
Activity Spreadsheet -- Enzyme Inhibition Constant Data from BindingDB
Found 4 hits for monomerid = 483679
TargetMonoglyceride lipase(Homo sapiens (Human))
Lundbeck La Jolla Research Center
US Patent
LigandPNGBDBM483679(4-chloro-1-(4-((5- chloro-2- (trifluoromethyl)- be...)
Affinity DataIC50: <100nM. Assay description: Proteomes (mouse brain membrane fraction for mouse assays; human prefrontal cortex membrane fractions for human assays) (50 mL, 1.0 mg/mL total prote...
Ligand InfoPC cidPC sid
In DepthDetails US Patent
TargetFatty-acid amide hydrolase 1(Homo sapiens (Human))
H. Lundbeck
US Patent
LigandPNGBDBM483679(4-chloro-1-(4-((5- chloro-2- (trifluoromethyl)- be...)
Affinity DataIC50:  550nM. Assay description: Proteomes (mouse brain membrane fraction for mouse assays; human prefrontal cortex membrane fractions for human assays) (50 mL, 1.0 mg/mL total prote...
Ligand InfoPC cidPC sid
In DepthDetails US Patent
TargetMonoglyceride lipase(Homo sapiens (Human))
Lundbeck La Jolla Research Center
US Patent
LigandPNGBDBM483679(4-chloro-1-(4-((5- chloro-2- (trifluoromethyl)- be...)
Affinity DataIC50: <100nM. Assay description: Proteomes (mouse brain membrane fraction for mouse assays; human prefrontal cortex membrane fractions for human assays) (50 mL, 1.0 mg/mL total prote...
Ligand InfoPC cidPC sid
In DepthDetails US Patent
TargetFatty acid 2-hydroxylase(Human)
Lundbeck La Jolla Research Center
US Patent
LigandPNGBDBM483679(4-chloro-1-(4-((5- chloro-2- (trifluoromethyl)- be...)
Affinity DataIC50:  550nM. Assay description: Proteomes (mouse brain membrane fraction for mouse assays; human prefrontal cortex membrane fractions for human assays) (50 mL, 1.0 mg/mL total prote...
Ligand InfoPC cidPC sid
In DepthDetails US Patent