BDBM483681 1-(5-(3-chloro-5- (trifluoromethyl)- benzyl)- octahydropyrrolo- [3,4-c]pyrrole-2- carbonyl)-1H- pyrazole-3- carboxylic acid::US10927105, Ex 124::US11655217, Example 124
SMILES OC(=O)c1ccn(n1)C(=O)N1CC2CN(Cc3cc(Cl)cc(c3)C(F)(F)F)CC2C1
InChI Key InChIKey=VZYNLXBAVDUTLI-UHFFFAOYSA-N
Data  4 IC50
  Tab Delimited (TSV)   2D SDfile   Computed 3D by Vconf -m prep SDfile
Find this compound or compounds like it in BindingDB:
Activity Spreadsheet -- Enzyme Inhibition Constant Data from BindingDB
Found 4 hits for monomerid = 483681
TargetMonoglyceride lipase(Homo sapiens (Human))
Lundbeck La Jolla Research Center
US Patent
LigandPNGBDBM483681(1-(5-(3-chloro-5- (trifluoromethyl)- benzyl)- octa...)
Affinity DataIC50: <100nM. Assay description: Proteomes (mouse brain membrane fraction for mouse assays; human prefrontal cortex membrane fractions for human assays) (50 mL, 1.0 mg/mL total prote...
Ligand InfoPC cidPC sid
In DepthDetails US Patent
TargetFatty-acid amide hydrolase 1(Homo sapiens (Human))
H. Lundbeck
US Patent
LigandPNGBDBM483681(1-(5-(3-chloro-5- (trifluoromethyl)- benzyl)- octa...)
Affinity DataIC50:  550nM. Assay description: Proteomes (mouse brain membrane fraction for mouse assays; human prefrontal cortex membrane fractions for human assays) (50 mL, 1.0 mg/mL total prote...
Ligand InfoPC cidPC sid
In DepthDetails US Patent
TargetMonoglyceride lipase(Homo sapiens (Human))
Lundbeck La Jolla Research Center
US Patent
LigandPNGBDBM483681(1-(5-(3-chloro-5- (trifluoromethyl)- benzyl)- octa...)
Affinity DataIC50: <100nM. Assay description: Proteomes (mouse brain membrane fraction for mouse assays; human prefrontal cortex membrane fractions for human assays) (50 mL, 1.0 mg/mL total prote...
Ligand InfoPC cidPC sid
In DepthDetails US Patent
TargetFatty acid 2-hydroxylase(Human)
Lundbeck La Jolla Research Center
US Patent
LigandPNGBDBM483681(1-(5-(3-chloro-5- (trifluoromethyl)- benzyl)- octa...)
Affinity DataIC50:  550nM. Assay description: Proteomes (mouse brain membrane fraction for mouse assays; human prefrontal cortex membrane fractions for human assays) (50 mL, 1.0 mg/mL total prote...
Ligand InfoPC cidPC sid
In DepthDetails US Patent