BDBM483711 1-(4-((4- (trifluoromethyl)- pyridin-3- yl)methyl)- piperazine-1- carbonyl)-1H- pyrazole-3- carboxamide::US10927105, Ex 175::US11655217, Example 175
SMILES NC(=O)c1ccn(n1)C(=O)N1CCN(Cc2cnccc2C(F)(F)F)CC1
InChI Key InChIKey=OOZQDLPPYJHYIO-UHFFFAOYSA-N
Data  4 IC50
  Tab Delimited (TSV)   2D SDfile   Computed 3D by Vconf -m prep SDfile
Find this compound or compounds like it in BindingDB:
Activity Spreadsheet -- Enzyme Inhibition Constant Data from BindingDB
Found 4 hits for monomerid = 483711
TargetMonoglyceride lipase(Homo sapiens (Human))
Lundbeck La Jolla Research Center
US Patent
LigandPNGBDBM483711(1-(4-((4- (trifluoromethyl)- pyridin-3- yl)methyl)...)
Affinity DataIC50: <100nM. Assay description: Proteomes (mouse brain membrane fraction for mouse assays; human prefrontal cortex membrane fractions for human assays) (50 mL, 1.0 mg/mL total prote...
Ligand InfoPC cidPC sid
In DepthDetails US Patent
TargetFatty-acid amide hydrolase 1(Homo sapiens (Human))
H. Lundbeck
US Patent
LigandPNGBDBM483711(1-(4-((4- (trifluoromethyl)- pyridin-3- yl)methyl)...)
Affinity DataIC50:  550nM. Assay description: Proteomes (mouse brain membrane fraction for mouse assays; human prefrontal cortex membrane fractions for human assays) (50 mL, 1.0 mg/mL total prote...
Ligand InfoPC cidPC sid
In DepthDetails US Patent
TargetMonoglyceride lipase(Homo sapiens (Human))
Lundbeck La Jolla Research Center
US Patent
LigandPNGBDBM483711(1-(4-((4- (trifluoromethyl)- pyridin-3- yl)methyl)...)
Affinity DataIC50: <100nM. Assay description: Proteomes (mouse brain membrane fraction for mouse assays; human prefrontal cortex membrane fractions for human assays) (50 mL, 1.0 mg/mL total prote...
Ligand InfoPC cidPC sid
In DepthDetails US Patent
TargetFatty acid 2-hydroxylase(Human)
Lundbeck La Jolla Research Center
US Patent
LigandPNGBDBM483711(1-(4-((4- (trifluoromethyl)- pyridin-3- yl)methyl)...)
Affinity DataIC50:  550nM. Assay description: Proteomes (mouse brain membrane fraction for mouse assays; human prefrontal cortex membrane fractions for human assays) (50 mL, 1.0 mg/mL total prote...
Ligand InfoPC cidPC sid
In DepthDetails US Patent