BDBM484603 US10934294, Example 121::US11028092, Example 121
SMILES C[C@@H](c1ccc(nc1)C(F)(F)F)n1nc(C#N)c2c1nc([nH]c2=O)C1CCC1c1nccc(n1)C(C)(C)C
InChI Key
Data  2 KI
  Tab Delimited (TSV)   2D SDfile   Computed 3D by Vconf -m prep SDfile
Find this compound or compounds like it in BindingDB:
Activity Spreadsheet -- Enzyme Inhibition Constant Data from BindingDB
Found 2 hits for monomerid = 484603
TargetHigh affinity cGMP-specific 3',5'-cyclic phosphodiesterase 9A(Homo sapiens (Human))
Merck Sharp & Dohme
US Patent
LigandPNGBDBM484603(US10934294, Example 121 | US11028092, Example 121)
Affinity DataKi:  23.7nM. Assay description: Assays for PDE 1 through 11 were performed in parallel at room temperature in 384-well microtiter plates with an incubation volume of 20.2 μL. S...
Ligand InfoPC cidPC sid
In DepthDetails US Patent
LigandPNGBDBM484603(US10934294, Example 121 | US11028092, Example 121)
Affinity DataKi:  23.7nM. Assay description: Human PDE9 (PDE9A2, GenBank Accession No. NM_001001567), full length with N-terminal GST tag, was purchased from BPS Bioscience. The fluorescence pol...
Ligand InfoPC cidPC sid
In DepthDetails US Patent