BDBM48554 (4Z)-3-hydroxy-4-(4-quinolin-8-yl-1,2-dihydropyrazol-3-ylidene)cyclohexa-2,5-dien-1-one::(4Z)-3-hydroxy-4-[4-(8-quinolinyl)-1,2-dihydropyrazol-3-ylidene]-1-cyclohexa-2,5-dienone::(4Z)-3-hydroxy-4-[4-(8-quinolyl)-3-pyrazolin-3-ylidene]cyclohexa-2,5-dien-1-one::(4Z)-3-oxidanyl-4-(4-quinolin-8-yl-1,2-dihydropyrazol-3-ylidene)cyclohexa-2,5-dien-1-one::MLS000054375::SMR000065872::cid_5668702
SMILES Oc1ccc(-c2n[nH]cc2-c2cccc3cccnc23)c(O)c1
InChI Key InChIKey=RNARQCIJGRDWAK-UHFFFAOYSA-N
Data  2 IC50  2 EC50
  Tab Delimited (TSV)   2D SDfile   Computed 3D by Vconf -m prep SDfile
Find this compound or compounds like it in BindingDB:
Activity Spreadsheet -- Enzyme Inhibition Constant Data from BindingDB
Found 4 hits for monomerid = 48554
TargetEukaryotic translation initiation factor 4 gamma 1(Homo sapiens (Human))
Emory University
Curated by PubChem BioAssay
LigandPNGBDBM48554((4Z)-3-hydroxy-4-(4-quinolin-8-yl-1,2-dihydropyraz...)
Affinity DataIC50:  6.40E+4nM. Assay description: Dose Response Confirmation for Small Molecule Inhibitors of Eukaryotic Translation Initiation NIH Molecular Libraries Screening Centers Network [MLSC...
In DepthDetails PCBioAssay
TargetImportin subunit alpha-1(Homo sapiens (Human))
Broad Institute
Curated by PubChem BioAssay
LigandPNGBDBM48554((4Z)-3-hydroxy-4-(4-quinolin-8-yl-1,2-dihydropyraz...)
Affinity DataEC50: >5.00E+5nM. Assay description: Keywords: Counterscreen, FRET assay, HTS, YIC probe, Dose response, Assay Overview: This is a fluorescence resonance energy transfer (FRET)-based b...
In DepthDetails PCBioAssay
TargetLarge T antigen(Simian virus 40)
Southern Research Specialized Biocontainment Screening Center
Curated by PubChem BioAssay
LigandPNGBDBM48554((4Z)-3-hydroxy-4-(4-quinolin-8-yl-1,2-dihydropyraz...)
Affinity DataEC50:  1.73E+4nM. Assay description: Southern Research's Specialized Biocontainment Screening Center (SRSBSC) Southern Research Institute (Birmingham, Alabama) NIH Molecular Librarie...
In DepthDetails PCBioAssay
TargetLarge T antigen(Simian virus 40)
Southern Research Specialized Biocontainment Screening Center
Curated by PubChem BioAssay
LigandPNGBDBM48554((4Z)-3-hydroxy-4-(4-quinolin-8-yl-1,2-dihydropyraz...)
Affinity DataIC50:  2.57E+4nM. Assay description: A biochemical assay using the ADP-Hunter methodology, purified TAg, and ATP to identify compounds that inhibit the ATPase activity of Tag Southern Re...
In DepthDetails PCBioAssay