BDBM486376 3-(3-cyclopropylphenyl)-1-(5- fluoropyridin-2-yl)-N-(3-methyl-1,1- dioxidotetrahydrothiophen-3-yl)-1H- indole-6-carboxamide (enantiomer B)::US10947222, Example 12-B
SMILES C[C@@]1(CCS(=O)(=O)C1)NC(=O)c1ccc2c(cn(-c3ccc(F)cn3)c2c1)-c1cccc(c1)C1CC1
InChI Key InChIKey=FPMGSBBCNNBWBP-NDEPHWFRSA-N
Data  1 IC50
  Tab Delimited (TSV)   2D SDfile   Computed 3D by Vconf -m prep SDfile
Find this compound or compounds like it in BindingDB:
Activity Spreadsheet -- Enzyme Inhibition Constant Data from BindingDB
Found 1 hit for monomerid = 486376
TargetDiacylglycerol O-acyltransferase 2(Homo sapiens (Human))
Merck Sharp & Dohme
US Patent
LigandPNGBDBM486376(3-(3-cyclopropylphenyl)-1-(5- fluoropyridin-2-yl)-...)
Affinity DataIC50:  0.730nM. Assay description: DGAT2 activity was determined by measuring the amount of enzymatic product triolein (1,2,3-Tri(cis-9-octadecenoyl)glycerol) using the membrane prep m...
Ligand InfoPC cidPC sid
In DepthDetails US Patent