BDBM489185 US10961233, Example 24
SMILES CN(C)CCCOC(=O)N1CCN(CC1)c1ccc(Br)c(NC(=O)c2coc(N)n2)c1
InChI Key InChIKey=AIRUAIFFTSUINK-UHFFFAOYSA-N
Data  1 IC50
  Tab Delimited (TSV)   2D SDfile   Computed 3D by Vconf -m prep SDfile
Find this compound or compounds like it in BindingDB:
Activity Spreadsheet -- Enzyme Inhibition Constant Data from BindingDB
Found 1 hit for monomerid = 489185
LigandPNGBDBM489185(US10961233, Example 24)
Affinity DataIC50:  17.5nM. Assay description: 5 μl WT full length PAICS (final assay concentration, fac, 2.5 nM) in basic buffer, added to black, non-binding, 384-well plates (Corning #3575)...
Ligand InfoPC cidPC sid
In DepthDetails US Patent