BDBM489189 US10961233, Example 30
SMILES CN1CCC(C1)OC(=O)N1CCN(CC1)c1ccc(Cl)c(NC(=O)c2coc(N)n2)c1
InChI Key InChIKey=HMNFSLACWPMXBS-UHFFFAOYSA-N
Data  1 IC50
  Tab Delimited (TSV)   2D SDfile   Computed 3D by Vconf -m prep SDfile
Find this compound or compounds like it in BindingDB:
Activity Spreadsheet -- Enzyme Inhibition Constant Data from BindingDB
Found 1 hit for monomerid = 489189
LigandPNGBDBM489189(US10961233, Example 30)
Affinity DataIC50: >100nM. Assay description: 5 μl WT full length PAICS (final assay concentration, fac, 2.5 nM) in basic buffer, added to black, non-binding, 384-well plates (Corning #3575)...
Ligand InfoPC cidPC sid
In DepthDetails US Patent