BDBM489761 US10995099, Example 18::US10995099, Example 3
SMILES COc1ccccc1C(Cn1c2sc(c(C)c2c(=O)n(c1=O)C1(CC1)C(O)=O)C(F)(F)F)OC1CCOCC1
InChI Key InChIKey=FHPIGRRDTSMDQJ-UHFFFAOYSA-N
Data  2 IC50
  Tab Delimited (TSV)   2D SDfile   Computed 3D by Vconf -m prep SDfile
Find this compound or compounds like it in BindingDB:
Activity Spreadsheet -- Enzyme Inhibition Constant Data from BindingDB
Found 2 hits for monomerid = 489761
TargetAcetyl-CoA carboxylase 2(Homo sapiens (Human))
Nanjing Ruijie Pharmatech
US Patent
LigandPNGBDBM489761(US10995099, Example 18 | US10995099, Example 3)
Affinity DataIC50: >1.00E+3nM. Assay description: An exemplary procedure for the in vitro ACC inhibition assay, which can be used to determine the inhibitory action of compounds of the invention towa...
Ligand InfoPC cidPC sid
In DepthDetails US Patent
TargetAcetyl-CoA carboxylase 2(Homo sapiens (Human))
Nanjing Ruijie Pharmatech
US Patent
LigandPNGBDBM489761(US10995099, Example 18 | US10995099, Example 3)
Affinity DataIC50:  55nM. Assay description: An exemplary procedure for the in vitro ACC inhibition assay, which can be used to determine the inhibitory action of compounds of the invention towa...
Ligand InfoPC cidPC sid
In DepthDetails US Patent