BDBM489784 US10995099, Example 28
SMILES COc1ccccc1[C@@H](Cn1c2sc(c(C)c2c(=O)n(c1=O)C1(CC1)C(O)=O)-c1ncco1)OC1CCOCC1
InChI Key InChIKey=LVPFTXZQRZIZAQ-HXUWFJFHSA-N
Data  1 IC50
  Tab Delimited (TSV)   2D SDfile   Computed 3D by Vconf -m prep SDfile
Find this compound or compounds like it in BindingDB:
Activity Spreadsheet -- Enzyme Inhibition Constant Data from BindingDB
Found 1 hit for monomerid = 489784
TargetAcetyl-CoA carboxylase 2(Homo sapiens (Human))
Nanjing Ruijie Pharmatech
US Patent
LigandPNGBDBM489784(US10995099, Example 28)
Affinity DataIC50:  550nM. Assay description: An exemplary procedure for the in vitro ACC inhibition assay, which can be used to determine the inhibitory action of compounds of the invention towa...
Ligand InfoPC cidPC sid
In DepthDetails US Patent