BDBM490681 US10968236, Compound I-8
SMILES C[C@](O)(C(O)=O)c1ccc(Nc2nc(nc3CNC(=O)c23)-c2c(F)cccc2F)cc1
InChI Key InChIKey=BMQJYEMWHPPYOB-OAQYLSRUSA-N
Data  2 KI
  Tab Delimited (TSV)   2D SDfile   Computed 3D by Vconf -m prep SDfile
Find this compound or compounds like it in BindingDB:
Activity Spreadsheet -- Enzyme Inhibition Constant Data from BindingDB
Found 2 hits for monomerid = 490681
TargetNon-receptor tyrosine-protein kinase TYK2(Homo sapiens (Human))
Nimbus Lakshmi
US Patent
LigandPNGBDBM490681(US10968236, Compound I-8)
Affinity DataKi: <10nM. Assay description: Tyk2 & JAK2: The caliper machine employs an off chip mobility shift assay to detect phosphorylated peptide substrates from kinase assays, using micro...
Ligand InfoPC cidPC sid
In DepthDetails US Patent
TargetTyrosine-protein kinase JAK2(Homo sapiens (Human))
Nimbus Lakshmi
US Patent
LigandPNGBDBM490681(US10968236, Compound I-8)
Affinity DataKi:  550nM. Assay description: Tyk2 & JAK2: The caliper machine employs an off chip mobility shift assay to detect phosphorylated peptide substrates from kinase assays, using micro...
Ligand InfoPC cidPC sid
In DepthDetails US Patent