BDBM490747 US10968236, Compound I-75
SMILES Fc1cccc(C#N)c1-c1cc(Nc2ccc(nc2)N2CCC3(CC3)CC2)c2C(=O)NCc2n1
InChI Key InChIKey=WAULDFSIVLFWSH-UHFFFAOYSA-N
Data  2 KI
  Tab Delimited (TSV)   2D SDfile   Computed 3D by Vconf -m prep SDfile
Find this compound or compounds like it in BindingDB:
Activity Spreadsheet -- Enzyme Inhibition Constant Data from BindingDB
Found 2 hits for monomerid = 490747
TargetTyrosine-protein kinase JAK2(Homo sapiens (Human))
Nimbus Lakshmi
US Patent
LigandPNGBDBM490747(US10968236, Compound I-75)
Affinity DataKi: <10nM. Assay description: Tyk2 & JAK2: The caliper machine employs an off chip mobility shift assay to detect phosphorylated peptide substrates from kinase assays, using micro...
Ligand InfoPC cidPC sid
In DepthDetails US Patent
TargetNon-receptor tyrosine-protein kinase TYK2(Homo sapiens (Human))
Nimbus Lakshmi
US Patent
LigandPNGBDBM490747(US10968236, Compound I-75)
Affinity DataKi: <10nM. Assay description: Tyk2 & JAK2: The caliper machine employs an off chip mobility shift assay to detect phosphorylated peptide substrates from kinase assays, using micro...
Ligand InfoPC cidPC sid
In DepthDetails US Patent