BDBM490754 US10968236, Compound I-82
SMILES C[C@](O)(c1ccc(Nc2cc(nc3CNC(=O)c23)-c2c(F)cccc2F)nc1)C(F)(F)F
InChI Key InChIKey=OQXNCJPDSBEUHQ-FQEVSTJZSA-N
Data  2 KI
  Tab Delimited (TSV)   2D SDfile   Computed 3D by Vconf -m prep SDfile
Find this compound or compounds like it in BindingDB:
Activity Spreadsheet -- Enzyme Inhibition Constant Data from BindingDB
Found 2 hits for monomerid = 490754
TargetTyrosine-protein kinase JAK2(Homo sapiens (Human))
Nimbus Lakshmi
US Patent
LigandPNGBDBM490754(US10968236, Compound I-82)
Affinity DataKi: <10nM. Assay description: Tyk2 & JAK2: The caliper machine employs an off chip mobility shift assay to detect phosphorylated peptide substrates from kinase assays, using micro...
Ligand InfoPC cidPC sid
In DepthDetails US Patent
TargetNon-receptor tyrosine-protein kinase TYK2(Homo sapiens (Human))
Nimbus Lakshmi
US Patent
LigandPNGBDBM490754(US10968236, Compound I-82)
Affinity DataKi: <10nM. Assay description: Tyk2 & JAK2: The caliper machine employs an off chip mobility shift assay to detect phosphorylated peptide substrates from kinase assays, using micro...
Ligand InfoPC cidPC sid
In DepthDetails US Patent