BDBM490789 US10968242, Example 17 Peak 1
SMILES Cn1cnc2n(cnc2c1=O)[C@@H]1C[C@@H]2OP(S)(=S)O[C@H]3[C@@H](F)[C@@H](O[C@@H]3COP(S)(=O)O[C@@H]1[C@@H]2O)n1cnc2c(N)ncnc12
InChI Key InChIKey=CQZPNWQHPYNXRU-VULZSUNMSA-N
Data  1 KI  2 Kd
  Tab Delimited (TSV)   2D SDfile   Computed 3D by Vconf -m prep SDfile
Find this compound or compounds like it in BindingDB:
Activity Spreadsheet -- Enzyme Inhibition Constant Data from BindingDB
Found 3 hits for monomerid = 490789
TargetStimulator of interferon genes protein(Human)
Pfizer
US Patent
LigandPNGBDBM490789(US10968242, Example 17 Peak 1)
Affinity DataKi:  2nM. Assay description: A radioligand binding assay was developed to determine compound interactions were competitive with a tritium-labeled version of the native STING liga...
Ligand InfoPC cidPC sid
In DepthDetails US Patent
TargetStimulator of interferon genes protein [H232R](Homo sapiens (Human))
Pfizer
US Patent
LigandPNGBDBM490789(US10968242, Example 17 Peak 1)
Affinity DataKd:  4nM. Assay description: Surface plasmon resonance (SPR) STING agonist binding studies were carried out using a Biacore T200 instrument (GE Healthcare) at 4° C. in a 150 mM K...
Ligand InfoPC cidPC sid
In DepthDetails US Patent
TargetStimulator of interferon genes protein(Human)
Pfizer
US Patent
LigandPNGBDBM490789(US10968242, Example 17 Peak 1)
Affinity DataKd:  1.5nM. Assay description: Surface plasmon resonance (SPR) STING agonist binding studies were carried out using a Biacore T200 instrument (GE Healthcare) at 4° C. in a 150 mM K...
Ligand InfoPC cidPC sid
In DepthDetails US Patent