BDBM495037 US10995084, Ex. No. 1A-4
SMILES Cc1cc(Cc2ccc(cc2C)C(=O)NCC(=O)N2[C@@H](CC[C@@H]2C(C)(C)C#N)c2cccc(Cl)c2)c(=O)[nH]n1
InChI Key
Data  1 KI  1 IC50
  Tab Delimited (TSV)   2D SDfile   Computed 3D by Vconf -m prep SDfile
Find this compound or compounds like it in BindingDB:
Activity Spreadsheet -- Enzyme Inhibition Constant Data from BindingDB
Found 2 hits for monomerid = 495037
TargetCalcitonin gene-related peptide type 1 receptor(Homo sapiens (Human))
Kissei Pharmaceutical
US Patent
LigandPNGBDBM495037(US10995084, Ex. No. 1A-4)
Affinity DataKi:  0.0300nM. Assay description: The binding affinity assay of compounds for human CGRP receptor was carried out by inhibition of radiolabeled ligand [125I]-CGRP binding in human neu...
Ligand InfoPC cidPC sid
In DepthDetails US Patent
TargetCalcitonin gene-related peptide type 1 receptor(Homo sapiens (Human))
Kissei Pharmaceutical
US Patent
LigandPNGBDBM495037(US10995084, Ex. No. 1A-4)
Affinity DataIC50:  0.0400nM. Assay description: The binding affinity assay of compounds for human CGRP receptor was carried out by inhibition of radiolabeled ligand [125I]-CGRP binding in human neu...
Ligand InfoPC cidPC sid
In DepthDetails US Patent