BDBM49540 1-ethyl-2-(2-phenylvinyl)-1H-benzimidazole::1-ethyl-2-[(E)-2-phenylethenyl]benzimidazole::1-ethyl-2-[(E)-styryl]benzimidazole::MLS000571725::SMR000193737::cid_5708371
SMILES CCn1c(\C=C\c2ccccc2)nc2ccccc12
InChI Key InChIKey=MEAHBJZHTOKGMH-OUKQBFOZSA-N
Data  1 EC50
  Tab Delimited (TSV)   2D SDfile   Computed 3D by Vconf -m prep SDfile
Find this compound or compounds like it in BindingDB:
Activity Spreadsheet -- Enzyme Inhibition Constant Data from BindingDB
Found 1 hit for monomerid = 49540
TargetTranscription factor p65(Homo sapiens (Human))
Srmlsc
Curated by PubChem BioAssay
LigandPNGBDBM49540(1-ethyl-2-(2-phenylvinyl)-1H-benzimidazole | 1-eth...)
Affinity DataEC50:  1.58E+3nM. Assay description: Southern Research Molecular Libraries Screening Center (SRMLSC) Southern Research Institute (Birmingham, Alabama) NIH Molecular Libraries Screening C...
In DepthDetails PCBioAssay