BDBM495431 MAT-POS-4223bc15-1
SMILES CNS(=O)(=O)N1CC(C(=O)Nc2cncc3ccccc23)c2cc(Cl)ccc2C1
InChI Key InChIKey=ZTUNSYBLVPAFKR-UHFFFAOYSA-N
Data  3 IC50
  Tab Delimited (TSV)   2D SDfile   Computed 3D by Vconf -m prep SDfile
Find this compound or compounds like it in BindingDB:
Activity Spreadsheet -- Enzyme Inhibition Constant Data from BindingDB
Found 3 hits for monomerid = 495431
TargetReplicase polyprotein 1ab(2019-nCoV)
Israel Institution Of Biological Research
LigandPNGBDBM495431(MAT-POS-4223bc15-1)
Affinity DataIC50:  149nM. Assay description: Compounds were seeded into assay-ready plates (Greiner 384 low volume, cat 784900) using an Echo 555 acoustic dispenser, and DMSO was back-filled for...
In DepthDetails
TargetReplicase polyprotein 1ab(2019-nCoV)
Israel Institution Of Biological Research
LigandPNGBDBM495431(MAT-POS-4223bc15-1)
Affinity DataIC50:  149nM. Assay description: This assay is for S2.
In DepthDetails PubMed
TargetReplicase polyprotein 1ab(2019-nCoV)
Israel Institution Of Biological Research
LigandPNGBDBM495431(MAT-POS-4223bc15-1)
Affinity DataIC50:  149nM. Assay description: Compounds were seeded into assay-ready plates (Greiner 384 low volume, cat. no. 784900) using an Echo 555 acoustic dispenser, and dimethyl sulfoxide ...
In DepthDetails PubMed