BDBM49553 3-(1,3-benzodioxol-5-yl)-5-(4-bromophenyl)-2-methylsulfonyl-3,4-dihydropyrazole::5-(1,3-benzodioxol-5-yl)-3-(4-bromophenyl)-1-(methylsulfonyl)-4,5-dihydro-1H-pyrazole::5-(1,3-benzodioxol-5-yl)-3-(4-bromophenyl)-1-mesyl-2-pyrazoline::MLS000581723::SMR000200655::cid_2964786
SMILES CS(=O)(=O)N1N=C(CC1c1ccc2OCOc2c1)c1ccc(Br)cc1
InChI Key InChIKey=QZDMSRWCNXBDIE-UHFFFAOYSA-N
Data  1 EC50
  Tab Delimited (TSV)   2D SDfile   Computed 3D by Vconf -m prep SDfile
Find this compound or compounds like it in BindingDB:
Activity Spreadsheet -- Enzyme Inhibition Constant Data from BindingDB
Found 1 hit for monomerid = 49553
TargetTranscription factor p65(Homo sapiens (Human))
Srmlsc
Curated by PubChem BioAssay
LigandPNGBDBM49553(3-(1,3-benzodioxol-5-yl)-5-(4-bromophenyl)-2-methy...)
Affinity DataEC50:  2.68E+3nM. Assay description: Southern Research Molecular Libraries Screening Center (SRMLSC) Southern Research Institute (Birmingham, Alabama) NIH Molecular Libraries Screening C...
In DepthDetails PCBioAssay