BDBM496260 CVD-0013086::LON-WEI-4d77710c-2
SMILES Fc1ccc(cc1)-c1nc(c(o1)S(=O)(=O)Cc1ccccc1F)S(=O)(=O)c1ccccc1
InChI Key InChIKey=CIMCKIQLVFYXTP-UHFFFAOYSA-N
Data  3 IC50
  Tab Delimited (TSV)   2D SDfile   Computed 3D by Vconf -m prep SDfile
Find this compound or compounds like it in BindingDB:
Activity Spreadsheet -- Enzyme Inhibition Constant Data from BindingDB
Found 3 hits for monomerid = 496260
TargetReplicase polyprotein 1ab(2019-nCoV)
Israel Institution Of Biological Research
LigandPNGBDBM496260(CVD-0013086 | LON-WEI-4d77710c-2)
Affinity DataIC50:  99nM. Assay description: The assay was performed according to the published procedure. Briefly, compounds were seeded into assay-ready plates (Greiner 384PP, cat# 781280) usi...
Ligand InfoPC cidPC sid
In DepthDetails
TargetReplicase polyprotein 1ab(2019-nCoV)
Israel Institution Of Biological Research
LigandPNGBDBM496260(CVD-0013086 | LON-WEI-4d77710c-2)
Affinity DataIC50:  397nM. Assay description: Compounds were seeded into assay-ready plates (Greiner 384 low volume, cat. no. 784900) using an Echo 555 acoustic dispenser, and dimethyl sulfoxide ...
Ligand InfoPC cidPC sid
In DepthDetails PubMed
TargetReplicase polyprotein 1ab(2019-nCoV)
Israel Institution Of Biological Research
LigandPNGBDBM496260(CVD-0013086 | LON-WEI-4d77710c-2)
Affinity DataIC50:  397nM. Assay description: Compounds were seeded into assay-ready plates (Greiner 384 low volume, cat 784900) using an Echo 555 acoustic dispenser, and DMSO was back-filled for...
Ligand InfoPC cidPC sid
In DepthDetails