BDBM496265 CVD-0013091::LON-WEI-4d77710c-8
SMILES CCOC(=O)c1c(C)n(c2ccc(cc12)N(C(=O)c1ccco1)S(C)(=O)=O)S(C)(=O)=O
InChI Key InChIKey=KTMLBSZTILEAGY-UHFFFAOYSA-N
Data  3 IC50
  Tab Delimited (TSV)   2D SDfile   Computed 3D by Vconf -m prep SDfile
Find this compound or compounds like it in BindingDB:
Activity Spreadsheet -- Enzyme Inhibition Constant Data from BindingDB
Found 3 hits for monomerid = 496265
TargetReplicase polyprotein 1ab(2019-nCoV)
Israel Institution Of Biological Research
LigandPNGBDBM496265(CVD-0013091 | LON-WEI-4d77710c-8)
Affinity DataIC50:  147nM. Assay description: The assay was performed according to the published procedure. Briefly, compounds were seeded into assay-ready plates (Greiner 384PP, cat# 781280) usi...
Ligand InfoPC cidPC sid
In DepthDetails
TargetReplicase polyprotein 1ab(2019-nCoV)
Israel Institution Of Biological Research
LigandPNGBDBM496265(CVD-0013091 | LON-WEI-4d77710c-8)
Affinity DataIC50:  282nM. Assay description: Compounds were seeded into assay-ready plates (Greiner 384 low volume, cat. no. 784900) using an Echo 555 acoustic dispenser, and dimethyl sulfoxide ...
Ligand InfoPC cidPC sid
In DepthDetails PubMed
TargetReplicase polyprotein 1ab(2019-nCoV)
Israel Institution Of Biological Research
LigandPNGBDBM496265(CVD-0013091 | LON-WEI-4d77710c-8)
Affinity DataIC50:  282nM. Assay description: Compounds were seeded into assay-ready plates (Greiner 384 low volume, cat 784900) using an Echo 555 acoustic dispenser, and DMSO was back-filled for...
Ligand InfoPC cidPC sid
In DepthDetails