BDBM496818 SARS-CoV-2 PLpro Inhibitor, 48
SMILES CC(NC(=O)c1cc(N)ccc1C)c1cccc2cc[nH]c12
InChI Key
Data  1 IC50  1 Kd
  Tab Delimited (TSV)   2D SDfile   Computed 3D by Vconf -m prep SDfile
Find this compound or compounds like it in BindingDB:
Activity Spreadsheet -- Enzyme Inhibition Constant Data from BindingDB
Found 2 hits for monomerid = 496818
TargetReplicase polyprotein 1ab(2019-nCoV)
University Of Illinois At Chicago
LigandPNGBDBM496818(SARS-CoV-2 PLpro Inhibitor, 48)
Affinity DataKd:  3.03E+4nM. Assay description: The His-tagged SARS-CoV-2 PLpro enzyme was initially prepared in phosphate buffer and diluted to 50 ug/mL with 10 mM sodium acetate (pH 5.5) and immo...
Ligand InfoPC cidPC sid
In DepthDetails ArticlePubMed
TargetReplicase polyprotein 1ab(2019-nCoV)
University Of Illinois At Chicago
LigandPNGBDBM496818(SARS-CoV-2 PLpro Inhibitor, 48)
Affinity DataIC50:  4.70E+3nM. Assay description: The PLpro primary assay, which measures protease activity with the short peptide substrate Z-RLRGG-AMC (Bachem), was performed in black flat-bottom 3...
Ligand InfoPC cidPC sid
In DepthDetails ArticlePubMed