BDBM496833 SARS-CoV-2 PLpro Inhibitor, 63
SMILES C[C@@H](NC(=O)c1cc(ccc1C)N(C)C1CNC1)c1ccccc1-c1cccs1
InChI Key InChIKey=STQGFKZDLPDIGN-QGZVFWFLSA-N
Data  1 IC50
  Tab Delimited (TSV)   2D SDfile   Computed 3D by Vconf -m prep SDfile
Find this compound or compounds like it in BindingDB:
Activity Spreadsheet -- Enzyme Inhibition Constant Data from BindingDB
Found 1 hit for monomerid = 496833
TargetReplicase polyprotein 1ab(2019-nCoV)
University Of Illinois At Chicago
LigandPNGBDBM496833(SARS-CoV-2 PLpro Inhibitor, 63)
Affinity DataIC50: >4.00E+4nM. Assay description: The PLpro primary assay, which measures protease activity with the short peptide substrate Z-RLRGG-AMC (Bachem), was performed in black flat-bottom 3...
Ligand InfoPC cidPC sid
In DepthDetails ArticlePubMed