BDBM496854 SARS-CoV-2 PLpro Inhibitor, 84
SMILES C[C@@H](NC(=O)c1cc(NC2CNC2)ccc1C)c1cccc(c1)-c1ccc(CN2CC[C@H](O)C2)s1
InChI Key InChIKey=NDXWDWBHDSNJNP-DVECYGJZSA-N
Data  2 IC50  1 Kd
  Tab Delimited (TSV)   2D SDfile   Computed 3D by Vconf -m prep SDfile
Find this compound or compounds like it in BindingDB:
Activity Spreadsheet -- Enzyme Inhibition Constant Data from BindingDB
Found 3 hits for monomerid = 496854
TargetReplicase polyprotein 1ab(2019-nCoV)
University Of Illinois At Chicago
LigandPNGBDBM496854(SARS-CoV-2 PLpro Inhibitor, 84)
Affinity DataIC50:  700nM. Assay description: The PLpro primary assay, which measures protease activity with the short peptide substrate Z-RLRGG-AMC (Bachem), was performed in black flat-bottom 3...
Ligand InfoPC cidPC sid
In DepthDetails ArticlePubMed
TargetReplicase polyprotein 1ab(2019-nCoV)
University Of Illinois At Chicago
LigandPNGBDBM496854(SARS-CoV-2 PLpro Inhibitor, 84)
Affinity DataIC50:  700nM. Assay description: Inhibition of SARS-CoV-2 PLpro
Ligand InfoPC cidPC sid
In DepthDetails PubMed
TargetReplicase polyprotein 1ab(2019-nCoV)
University Of Illinois At Chicago
LigandPNGBDBM496854(SARS-CoV-2 PLpro Inhibitor, 84)
Affinity DataKd:  668nM. Assay description: The His-tagged SARS-CoV-2 PLpro enzyme was initially prepared in phosphate buffer and diluted to 50 ug/mL with 10 mM sodium acetate (pH 5.5) and immo...
Ligand InfoPC cidPC sid
In DepthDetails ArticlePubMed