BDBM496862 SARS-CoV-2 PLpro Inhibitor, 92
SMILES C[C@@H](NC(=O)c1cc(NC2CNC2)ccc1C)c1cccc(c1)-c1ccc(CN[C@@H]2CC[C@H](O)C2)s1
InChI Key InChIKey=IGVYCVBUHQMNRZ-QNIAMRLHSA-N
Data  2 IC50  1 Kd
PDB links: 1 PDB ID matches this monomer.
  Tab Delimited (TSV)   2D SDfile   Computed 3D by Vconf -m prep SDfile
Find this compound or compounds like it in BindingDB:
Activity Spreadsheet -- Enzyme Inhibition Constant Data from BindingDB
Found 3 hits for monomerid = 496862
TargetReplicase polyprotein 1ab(2019-nCoV)
University Of Illinois At Chicago
LigandPNGBDBM496862(SARS-CoV-2 PLpro Inhibitor, 92)
Affinity DataIC50:  210nM. Assay description: The PLpro primary assay, which measures protease activity with the short peptide substrate Z-RLRGG-AMC (Bachem), was performed in black flat-bottom 3...
Ligand InfoPC cidPC sidPDB
TargetReplicase polyprotein 1ab(2019-nCoV)
University Of Illinois At Chicago
LigandPNGBDBM496862(SARS-CoV-2 PLpro Inhibitor, 92)
Affinity DataIC50:  210nM. Assay description: Inhibition of SARS-CoV-2 PLpro
Ligand InfoPC cidPC sidPDB
TargetReplicase polyprotein 1ab(2019-nCoV)
University Of Illinois At Chicago
LigandPNGBDBM496862(SARS-CoV-2 PLpro Inhibitor, 92)
Affinity DataKd:  337nM. Assay description: The His-tagged SARS-CoV-2 PLpro enzyme was initially prepared in phosphate buffer and diluted to 50 ug/mL with 10 mM sodium acetate (pH 5.5) and immo...
Ligand InfoPC cidPC sidPDB