BDBM496878 indole chloropyridinyl-ester derived, 7g
SMILES Cc1ccc2[nH]ccc2c1C(=O)Oc1cncc(Cl)c1
InChI Key InChIKey=DAIJWARWMVCTPJ-UHFFFAOYSA-N
Data  1 IC50  1 EC50
  Tab Delimited (TSV)   2D SDfile   Computed 3D by Vconf -m prep SDfile
Find this compound or compounds like it in BindingDB:
Activity Spreadsheet -- Enzyme Inhibition Constant Data from BindingDB
Found 2 hits for monomerid = 496878
TargetReplicase polyprotein 1ab(2019-nCoV)
Purdue University
LigandPNGBDBM496878(indole chloropyridinyl-ester derived, 7g)
Affinity DataEC50: >1.00E+5nM. Assay description: VeroE6 cells and TMPRSS2-overexpressing VeroE6 (VeroE6TMPRSS2) cells were obtained from the Japanese Collection of Research Bioresource...
Ligand InfoPC cidPC sid
In DepthDetails ArticlePubMed
TargetReplicase polyprotein 1ab(2019-nCoV)
Purdue University
LigandPNGBDBM496878(indole chloropyridinyl-ester derived, 7g)
Affinity DataIC50:  1.03E+4nM. Assay description: IC50 values were determined for compounds that covalently inhibit SARS-CoV-2 3CLpro using our recently described assay and data fitting methods that ...
Ligand InfoPC cidPC sid
In DepthDetails ArticlePubMed