BDBM496894 FL-107::cmdc.202100576, 4e
SMILES OB(O)c1cc(cc(c1)[N+]([O-])=O)C(=O)Oc1c(Cl)cc(Cl)cc1[N+]([O-])=O
InChI Key InChIKey=RDWLGAJDNWUMHN-UHFFFAOYSA-N
Data  1 KI
  Tab Delimited (TSV)   2D SDfile   Computed 3D by Vconf -m prep SDfile
Find this compound or compounds like it in BindingDB:
Activity Spreadsheet -- Enzyme Inhibition Constant Data from BindingDB
Found 1 hit for monomerid = 496894
TargetReplicase polyprotein 1ab(Human SARS coronavirus (SARS-CoV) (Severe acute re...)
Experimental Drug Development Centre
LigandPNGBDBM496894(FL-107 | cmdc.202100576, 4e)
Affinity DataKi:  6.90E+3nM. Assay description: Please point to the patents.
Ligand InfoPC cidPC sid
In DepthDetails ArticlePubMed