BDBM496916 US10995099, Example 50
SMILES CNC(=O)C1(CCCC1)n1c(=O)n(CC(OC2CCOCC2)c2ccccc2OC)c2sc(Br)c(C)c2c1=O
InChI Key InChIKey=AUYZRYMGYDPASO-UHFFFAOYSA-N
Data  1 IC50
  Tab Delimited (TSV)   2D SDfile   Computed 3D by Vconf -m prep SDfile
Find this compound or compounds like it in BindingDB:
Activity Spreadsheet -- Enzyme Inhibition Constant Data from BindingDB
Found 1 hit for monomerid = 496916
TargetAcetyl-CoA carboxylase 2(Homo sapiens (Human))
Nanjing Ruijie Pharmatech
US Patent
LigandPNGBDBM496916(US10995099, Example 50)
Affinity DataIC50:  55nM. Assay description: An exemplary procedure for the in vitro ACC inhibition assay, which can be used to determine the inhibitory action of compounds of the invention towa...
Ligand InfoPC cidPC sid
In DepthDetails US Patent