BDBM496924 cmdc.202100576, 13d
SMILES CN1C(=O)C(=O)c2cc(ccc12)C(=O)N1CCOCC1
InChI Key InChIKey=OTKOUGYSPDRVGM-UHFFFAOYSA-N
Data  1 IC50
  Tab Delimited (TSV)   2D SDfile   Computed 3D by Vconf -m prep SDfile
Find this compound or compounds like it in BindingDB:
Activity Spreadsheet -- Enzyme Inhibition Constant Data from BindingDB
Found 1 hit for monomerid = 496924
TargetReplicase polyprotein 1ab(Human SARS coronavirus (SARS-CoV) (Severe acute re...)
Experimental Drug Development Centre
LigandPNGBDBM496924(cmdc.202100576, 13d)
Affinity DataIC50:  3.64E+4nM. Assay description: Please point to the patents.
Ligand InfoPC cidPC sid
In DepthDetails ArticlePubMed