BDBM497002 US11001561, Compound 2a
SMILES Cc1nc(cc(=O)n1-c1cccc(Cl)c1Cl)N1CCC(C)(N)CC1
InChI Key InChIKey=HGAOJDKDTHZJNB-UHFFFAOYSA-N
Data  1 IC50
  Tab Delimited (TSV)   2D SDfile   Computed 3D by Vconf -m prep SDfile
Find this compound or compounds like it in BindingDB:
Activity Spreadsheet -- Enzyme Inhibition Constant Data from BindingDB
Found 1 hit for monomerid = 497002
TargetTyrosine-protein phosphatase non-receptor type 11(Homo sapiens (Human))
Merck Patent
US Patent
LigandPNGBDBM497002(US11001561, Compound 2a)
Affinity DataIC50: >1.00E+4nM. Assay description: The inhibition of SHP2 by compounds of the invention was monitored using the surrogate substrate DiFMUP after protein activation by a peptide bearing...
Ligand InfoPC cidPC sid
In DepthDetails US Patent