BDBM497015 US11001561, Compound 11::US11702392, Compound 11
SMILES CC1(N)CCN(CC1)c1cc(=O)n(c(n1)C(F)F)-c1cccc(Cl)c1Cl
InChI Key InChIKey=GZBXSKZRKGPGIB-UHFFFAOYSA-N
Data  2 IC50
  Tab Delimited (TSV)   2D SDfile   Computed 3D by Vconf -m prep SDfile
Find this compound or compounds like it in BindingDB:
Activity Spreadsheet -- Enzyme Inhibition Constant Data from BindingDB
Found 2 hits for monomerid = 497015
TargetTyrosine-protein phosphatase non-receptor type 11(Homo sapiens)
Merck Patent
US Patent
LigandPNGBDBM497015(US11001561, Compound 11 | US11702392, Compound 11)
Affinity DataIC50:  3.80E+3nM. Assay description: The inhibition of SHP2 by compounds of the invention was monitored using the surrogate substrate DiFMUP after protein activation by a peptide bearing...
Ligand InfoPC cidPC sid
In DepthDetails US Patent
TargetTyrosine-protein phosphatase non-receptor type 11(Homo sapiens (Human))
Merck Patent
US Patent
LigandPNGBDBM497015(US11001561, Compound 11 | US11702392, Compound 11)
Affinity DataIC50:  3.80E+3nM. Assay description: The inhibition of SHP2 by compounds of the invention was monitored using the surrogate substrate DiFMUP after protein activation by a peptide bearing...
Ligand InfoPC cidPC sid
In DepthDetails US Patent