BDBM497049 US11001561, Compound 42::US11702392, Compound 41
SMILES Cc1nc(cc(=O)n1-c1cccc(Cl)c1Cl)N1CCC(CC1)NC[C@H](O)CO
InChI Key InChIKey=VRIXJOTVGWDUKV-AWEZNQCLSA-N
Data  2 IC50
  Tab Delimited (TSV)   2D SDfile   Computed 3D by Vconf -m prep SDfile
Find this compound or compounds like it in BindingDB:
Activity Spreadsheet -- Enzyme Inhibition Constant Data from BindingDB
Found 2 hits for monomerid = 497049
TargetTyrosine-protein phosphatase non-receptor type 11(Homo sapiens)
Merck Patent
US Patent
LigandPNGBDBM497049(US11001561, Compound 42 | US11702392, Compound 41)
Affinity DataIC50:  2.50E+3nM. Assay description: The inhibition of SHP2 by compounds of the invention was monitored using the surrogate substrate DiFMUP after protein activation by a peptide bearing...
Ligand InfoPC cidPC sid
In DepthDetails US Patent
TargetTyrosine-protein phosphatase non-receptor type 11(Homo sapiens (Human))
Merck Patent
US Patent
LigandPNGBDBM497049(US11001561, Compound 42 | US11702392, Compound 41)
Affinity DataIC50:  4.30E+3nM. Assay description: The inhibition of SHP2 by compounds of the invention was monitored using the surrogate substrate DiFMUP after protein activation by a peptide bearing...
Ligand InfoPC cidPC sid
In DepthDetails US Patent