BDBM497125 US11001561, Compound 100::US11702392, Compound 100
SMILES Cc1nc(N2CCN3CC(N)CC3C2)c(C)c(=O)n1-c1cccc(Cl)c1Cl
InChI Key InChIKey=XQWZANBQDWGHSK-UHFFFAOYSA-N
Data  2 IC50
  Tab Delimited (TSV)   2D SDfile   Computed 3D by Vconf -m prep SDfile
Find this compound or compounds like it in BindingDB:
Activity Spreadsheet -- Enzyme Inhibition Constant Data from BindingDB
Found 2 hits for monomerid = 497125
TargetTyrosine-protein phosphatase non-receptor type 11(Homo sapiens)
Merck Patent
US Patent
LigandPNGBDBM497125(US11001561, Compound 100 | US11702392, Compound 10...)
Affinity DataIC50:  5.80E+3nM. Assay description: The inhibition of SHP2 by compounds of the invention was monitored using the surrogate substrate DiFMUP after protein activation by a peptide bearing...
Ligand InfoPC cidPC sid
In DepthDetails US Patent
TargetTyrosine-protein phosphatase non-receptor type 11(Homo sapiens (Human))
Merck Patent
US Patent
LigandPNGBDBM497125(US11001561, Compound 100 | US11702392, Compound 10...)
Affinity DataIC50:  5.80E+3nM. Assay description: The inhibition of SHP2 by compounds of the invention was monitored using the surrogate substrate DiFMUP after protein activation by a peptide bearing...
Ligand InfoPC cidPC sid
In DepthDetails US Patent