BDBM497144 US11001561, Compound 119a::US11702392, Compound 119a
SMILES Cc1nc(cc(=O)n1-c1cccc(Cl)c1Cl)N1CCC2(Cc3ccccc3[C@H]2N)CC1
InChI Key InChIKey=PSVZVCXMHUGMIG-HSZRJFAPSA-N
Data  4 IC50
  Tab Delimited (TSV)   2D SDfile   Computed 3D by Vconf -m prep SDfile
Find this compound or compounds like it in BindingDB:
Activity Spreadsheet -- Enzyme Inhibition Constant Data from BindingDB
Found 4 hits for monomerid = 497144
TargetTyrosine-protein phosphatase non-receptor type 11(Homo sapiens (Human))
Merck Patent
US Patent
LigandPNGBDBM497144(US11001561, Compound 119a | US11702392, Compound 1...)
Affinity DataIC50:  270nM. Assay description: The inhibition of SHP2 by compounds of the invention was monitored using the surrogate substrate DiFMUP after protein activation by a peptide bearing...
Ligand InfoPC cidPC sid
In DepthDetails US Patent
TargetTyrosine-protein phosphatase non-receptor type 11(Homo sapiens)
Merck Patent
US Patent
LigandPNGBDBM497144(US11001561, Compound 119a | US11702392, Compound 1...)
Affinity DataIC50:  270nM. Assay description: The inhibition of SHP2 by compounds of the invention was monitored using the surrogate substrate DiFMUP after protein activation by a peptide bearing...
Ligand InfoPC cidPC sid
In DepthDetails US Patent
TargetTyrosine-protein phosphatase non-receptor type 11(Homo sapiens)
Merck Patent
US Patent
LigandPNGBDBM497144(US11001561, Compound 119a | US11702392, Compound 1...)
Affinity DataIC50:  0.800nM. Assay description: Antagonist activity at recombinant human N-terminal His6-tagged full length SHP2 expressed in Escherichia coli using DiFMUP as substrate measured aft...
Ligand InfoPC cidPC sid
In DepthDetails ArticlePubMed
TargetTyrosine-protein phosphatase non-receptor type 11(Homo sapiens)
Merck Patent
US Patent
LigandPNGBDBM497144(US11001561, Compound 119a | US11702392, Compound 1...)
Affinity DataIC50:  5nM. Assay description: Antagonist activity at SHP2 in human KYSE520 cells assessed as inhibition of ERK1/2 phosphorylation incubated for 2 hrs
Ligand InfoPC cidPC sid
In DepthDetails ArticlePubMed