BDBM497262 (4-(7-((1R,4S)-4- hydroxycyclohexyl)-2- (((S)-pentan-2-yl)amino)- 7H-pyrrolo[2,3- d]pyrimidin-5-yl)piperidin- 1-yl)(pyridin-2- yl)methanone::US11001586, Example 29
SMILES CCC[C@H](C)Nc1ncc2c(cn([C@H]3CC[C@H](O)CC3)c2n1)C1CCN(CC1)C(=O)c1ccccn1
InChI Key InChIKey=WLJALOYLOJDZQW-BVSLBCMMSA-N
Data  6 IC50
  Tab Delimited (TSV)   2D SDfile   Computed 3D by Vconf -m prep SDfile
Find this compound or compounds like it in BindingDB:
Activity Spreadsheet -- Enzyme Inhibition Constant Data from BindingDB
Found 6 hits for monomerid = 497262
TargetTyrosine-protein kinase Mer(Homo sapiens (Human))
The University Of North Carolina At Chapel Hill
US Patent
LigandPNGBDBM497262((4-(7-((1R,4S)-4- hydroxycyclohexyl)-2- (((S)-pent...)
Affinity DataIC50: <3nM. Assay description: Activity Against Mer Tyrosine Kinase.
Ligand InfoPC cidPC sid
In DepthDetails US Patent
TargetTyrosine-protein kinase receptor TYRO3(Homo sapiens (Human))
The University Of North Carolina At Chapel Hill
US Patent
LigandPNGBDBM497262((4-(7-((1R,4S)-4- hydroxycyclohexyl)-2- (((S)-pent...)
Affinity DataIC50:  275nM. Assay description: Activity Against Tyro3 Tyrosine Kinase.
Ligand InfoPC cidPC sid
In DepthDetails US Patent
TargetReceptor-type tyrosine-protein kinase FLT3(Homo sapiens (Human))
University Of North Carolina At Chapel Hill
Curated by ChEMBL
LigandPNGBDBM497262((4-(7-((1R,4S)-4- hydroxycyclohexyl)-2- (((S)-pent...)
Affinity DataIC50:  400nM. Assay description: Inhibition of FLT3 (unknown origin)
Ligand InfoPC cidPC sid
In DepthDetails ArticlePubMed
TargetTyrosine-protein kinase receptor UFO(Homo sapiens (Human))
University Of North Carolina At Chapel Hill
Curated by ChEMBL
LigandPNGBDBM497262((4-(7-((1R,4S)-4- hydroxycyclohexyl)-2- (((S)-pent...)
Affinity DataIC50:  580nM. Assay description: Inhibition of AXL (unknown origin)
Ligand InfoPC cidPC sid
In DepthDetails ArticlePubMed
TargetTyrosine-protein kinase receptor TYRO3(Homo sapiens (Human))
The University Of North Carolina At Chapel Hill
US Patent
LigandPNGBDBM497262((4-(7-((1R,4S)-4- hydroxycyclohexyl)-2- (((S)-pent...)
Affinity DataIC50:  95nM. Assay description: Inhibition of TYRO3 (unknown origin)
Ligand InfoPC cidPC sid
In DepthDetails ArticlePubMed
TargetTyrosine-protein kinase Mer(Homo sapiens (Human))
The University Of North Carolina At Chapel Hill
US Patent
LigandPNGBDBM497262((4-(7-((1R,4S)-4- hydroxycyclohexyl)-2- (((S)-pent...)
Affinity DataIC50:  3nM. Assay description: Inhibition of MERTK (unknown origin)
Ligand InfoPC cidPC sid
In DepthDetails ArticlePubMed