BDBM497322 (2,6-dimethylpyridin-4- yl)(4-(2-((4- hydroxybutyl)amino)-7- ((1r,4r)-4- hydroxycyclohexyl)-7H- pyrrolo[2,3-d]pyrimidin-5- yl)piperidin-1- yl)methanone::US11001586, Example 100
SMILES Cc1cc(cc(C)n1)C(=O)N1CCC(CC1)c1cn([C@H]2CC[C@H](O)CC2)c2nc(NCCCCO)ncc12
InChI Key InChIKey=VPRQPPWLEAVEAI-RQNOJGIXSA-N
Data  2 IC50
  Tab Delimited (TSV)   2D SDfile   Computed 3D by Vconf -m prep SDfile
Find this compound or compounds like it in BindingDB:
Activity Spreadsheet -- Enzyme Inhibition Constant Data from BindingDB
Found 2 hits for monomerid = 497322
TargetTyrosine-protein kinase receptor TYRO3(Homo sapiens (Human))
The University Of North Carolina At Chapel Hill
US Patent
LigandPNGBDBM497322((2,6-dimethylpyridin-4- yl)(4-(2-((4- hydroxybutyl...)
Affinity DataIC50: <50nM. Assay description: Activity Against Tyro3 Tyrosine Kinase.
Ligand InfoPC cidPC sid
In DepthDetails US Patent
TargetTyrosine-protein kinase Mer(Homo sapiens (Human))
The University Of North Carolina At Chapel Hill
US Patent
LigandPNGBDBM497322((2,6-dimethylpyridin-4- yl)(4-(2-((4- hydroxybutyl...)
Affinity DataIC50: <3nM. Assay description: Activity Against Mer Tyrosine Kinase.
Ligand InfoPC cidPC sid
In DepthDetails US Patent