BDBM497340 US11739077, Example 7
SMILES COc1c(NC(=O)C2CCCCC2C(=O)c2ccc(cc2)-c2cc[nH]n2)cnn1C
InChI Key
Data  1 IC50
  Tab Delimited (TSV)   2D SDfile   Computed 3D by Vconf -m prep SDfile
Find this compound or compounds like it in BindingDB:
Activity Spreadsheet -- Enzyme Inhibition Constant Data from BindingDB
Found 1 hit for monomerid = 497340
TargetUbiquitin carboxyl-terminal hydrolase 1(Homo sapiens (Human))
Insilico Medicine Ip
US Patent
LigandPNGBDBM497340(US11739077, Example 7)
Affinity DataIC50: <50nM. Assay description: Human recombinant USP1/UAF1 expressed in baculovirus infected Sf21 cells were used (R&D, E-568-050). Test compound and/or vehicle was incubated with ...
Ligand InfoPC cidPC sid
In DepthDetails US Patent