BDBM497374 US11739077, Example 31
SMILES O=C(Nc1nc(ns1)C1CC1)C1CCCCC1C(=O)c1ccc(cc1)-c1ccn[nH]1
InChI Key
Data  1 IC50
  Tab Delimited (TSV)   2D SDfile   Computed 3D by Vconf -m prep SDfile
Find this compound or compounds like it in BindingDB:
Activity Spreadsheet -- Enzyme Inhibition Constant Data from BindingDB
Found 1 hit for monomerid = 497374
TargetUbiquitin carboxyl-terminal hydrolase 1(Homo sapiens (Human))
Insilico Medicine Ip
US Patent
LigandPNGBDBM497374(US11739077, Example 31)
Affinity DataIC50: <50nM. Assay description: Human recombinant USP1/UAF1 expressed in baculovirus infected Sf21 cells were used (R&D, E-568-050). Test compound and/or vehicle was incubated with ...
Ligand InfoPC cidPC sid
In DepthDetails US Patent