BDBM497387 US11007200, Example 3b::US11426411, Example 3b
SMILES CN[C@]1(CCCC[C@@H]1NCCCc1ccc(F)cc1)c1ccccc1Cl
InChI Key InChIKey=OKBJBWKATFFGNY-FCHUYYIVSA-N
Data  4 KI
  Tab Delimited (TSV)   2D SDfile   Computed 3D by Vconf -m prep SDfile
Find this compound or compounds like it in BindingDB:
Activity Spreadsheet -- Enzyme Inhibition Constant Data from BindingDB
Found 4 hits for monomerid = 497387
TargetSigma non-opioid intracellular receptor 1(Homo sapiens (Human))
Medisynergics
US Patent
LigandPNGBDBM497387(US11007200, Example 3b | US11426411, Example 3b)
Affinity DataKi:  217nM. Assay description: Ki determinations were generously provided by the National Institute of Mental Health's Psychoactive Drug Screening Program (PDSP).
Ligand InfoPC cidPC sid
In DepthDetails US Patent
TargetSigma non-opioid intracellular receptor 1(Homo sapiens (Human))
Medisynergics
US Patent
LigandPNGBDBM497387(US11007200, Example 3b | US11426411, Example 3b)
Affinity DataKi:  217nM. Assay description: Procedures employed by the PDSP as described in the NIMH-PDSP Assay Protocol Book, Version II. The standard drug used in both Sigma subtype assays is...
Ligand InfoPC cidPC sid
In DepthDetails US Patent
TargetSigma intracellular receptor 2(Homo sapiens (Human))
Medisynergics
US Patent
LigandPNGBDBM497387(US11007200, Example 3b | US11426411, Example 3b)
Affinity DataKi:  675nM. Assay description: Ki determinations were generously provided by the National Institute of Mental Health's Psychoactive Drug Screening Program (PDSP).
Ligand InfoPC cidPC sid
In DepthDetails US Patent
TargetSigma intracellular receptor 2(Homo sapiens (Human))
Medisynergics
US Patent
LigandPNGBDBM497387(US11007200, Example 3b | US11426411, Example 3b)
Affinity DataKi:  675nM
Ligand InfoPC cidPC sid
In DepthDetails US Patent