BDBM497411 US11008301, Example 102
SMILES Clc1ccc(NC(=O)N[C@@H]2CCCN(C2=O)c2ccc(cc2)N2CCC3(CCCO3)CC2)cc1
InChI Key InChIKey=ASGQUPMXABGPAY-HSZRJFAPSA-N
Data  2 EC50
  Tab Delimited (TSV)   2D SDfile   Computed 3D by Vconf -m prep SDfile
Find this compound or compounds like it in BindingDB:
Activity Spreadsheet -- Enzyme Inhibition Constant Data from BindingDB
Found 2 hits for monomerid = 497411
TargetfMet-Leu-Phe receptor(Homo sapiens (Human))
Bristol-Myers Squibb
US Patent
LigandPNGBDBM497411(US11008301, Example 102)
Affinity DataEC50:  61nM. Assay description: FPR2 and FPR1 Cyclic Adenosine Monophosphate (cAMP) Assays. A mixture of forskolin (5 μM final for FPR2 or 10 μM final for FPR1) and IBMX (...
Ligand InfoPC cidPC sid
In DepthDetails US Patent
TargetN-formyl peptide receptor 2(Homo sapiens (Human))
Bristol-Myers Squibb
US Patent
LigandPNGBDBM497411(US11008301, Example 102)
Affinity DataEC50:  15nM. Assay description: FPR2 and FPR1 Cyclic Adenosine Monophosphate (cAMP) Assays. A mixture of forskolin (5 μM final for FPR2 or 10 μM final for FPR1) and IBMX (...
Ligand InfoPC cidPC sid
In DepthDetails US Patent