BDBM497437 US11008304, Example 24
SMILES CC(C)c1nnnn1-c1cccc(NC(=O)c2cc(-c3cn(cn3)C(C)C)c(C)cn2)n1
InChI Key InChIKey=AUXRFMFZNRASDC-UHFFFAOYSA-N
Data  1 IC50
  Tab Delimited (TSV)   2D SDfile   Computed 3D by Vconf -m prep SDfile
Find this compound or compounds like it in BindingDB:
Activity Spreadsheet -- Enzyme Inhibition Constant Data from BindingDB
Found 1 hit for monomerid = 497437
TargetMitogen-activated protein kinase kinase kinase 5(Homo sapiens (Human))
Enanta Pharmaceuticals
US Patent
LigandPNGBDBM497437(US11008304, Example 24)
Affinity DataIC50: >1.00E+3nM. Assay description: The ability (IC50) of compounds to inhibit ASK1 kinase activity was determined by HTRF® KinEASE™ Assay System. ASK1 was purchased from Thermofisher (...
Ligand InfoPC cidPC sid
In DepthDetails US Patent