BDBM497439 US11008304, Example 26
SMILES CC(C)n1cc(cn1)-c1cc(ncc1C)C(=O)Nc1cccc(n1)-c1nnnn1C(C)C
InChI Key InChIKey=SZYJUNMPFVUONU-UHFFFAOYSA-N
Data  1 IC50
  Tab Delimited (TSV)   2D SDfile   Computed 3D by Vconf -m prep SDfile
Find this compound or compounds like it in BindingDB:
Activity Spreadsheet -- Enzyme Inhibition Constant Data from BindingDB
Found 1 hit for monomerid = 497439
TargetMitogen-activated protein kinase kinase kinase 5(Homo sapiens (Human))
Enanta Pharmaceuticals
US Patent
LigandPNGBDBM497439(US11008304, Example 26)
Affinity DataIC50:  5.5nM. Assay description: The ability (IC50) of compounds to inhibit ASK1 kinase activity was determined by HTRF® KinEASE™ Assay System. ASK1 was purchased from Thermofisher (...
Ligand InfoPC cidPC sid
In DepthDetails US Patent