BDBM497452 US11008304, Example 39
SMILES CC(C)n1nnnc1-c1cccc(NC(=O)c2cc(-c3cnc(C)s3)c(C)cn2)n1
InChI Key InChIKey=JPGJCVCICHATJD-UHFFFAOYSA-N
Data  1 IC50
  Tab Delimited (TSV)   2D SDfile   Computed 3D by Vconf -m prep SDfile
Find this compound or compounds like it in BindingDB:
Activity Spreadsheet -- Enzyme Inhibition Constant Data from BindingDB
Found 1 hit for monomerid = 497452
TargetMitogen-activated protein kinase kinase kinase 5(Homo sapiens (Human))
Enanta Pharmaceuticals
US Patent
LigandPNGBDBM497452(US11008304, Example 39)
Affinity DataIC50:  5.5nM. Assay description: The ability (IC50) of compounds to inhibit ASK1 kinase activity was determined by HTRF® KinEASE™ Assay System. ASK1 was purchased from Thermofisher (...
Ligand InfoPC cidPC sid
In DepthDetails US Patent