BDBM497575 2-[6-[(1S,8R)-5-(2,6-difluorophenyl)- 11,11-dimethyl-3,4- diazatricyclo[6.2.1.02,7]undeca-2(7),3,5- trien-1-yl]pyrazin-2-yl]-4-[(1R)-1- ethylsulfonylethyl]oxazole::US11008312, Example 70
SMILES CCS(=O)(=O)[C@@H](C)c1coc(n1)-c1cncc(n1)[C@@]12CC[C@@H](c3cc(nnc13)-c1c(F)cccc1F)C2(C)C
InChI Key InChIKey=GBHSDZNXAQHXFE-DDARLKAASA-N
Data  1 IC50
  Tab Delimited (TSV)   2D SDfile   Computed 3D by Vconf -m prep SDfile
Find this compound or compounds like it in BindingDB:
Activity Spreadsheet -- Enzyme Inhibition Constant Data from BindingDB
Found 1 hit for monomerid = 497575
TargetNuclear receptor ROR-gamma(Homo sapiens (Human))
Genentech
US Patent
LigandPNGBDBM497575(2-[6-[(1S,8R)-5-(2,6-difluorophenyl)- 11,11-dimeth...)
Affinity DataIC50:  5.80nM. Assay description: 50 mM HEPES buffer (pH 7.4); 150 mM NaCl; 1 mM DTT; 5 mM MgCl2; 0.01% BSA; 5% DMSO; 0.6 ug/mL RORc receptor; 6 nM 25-[3H]hydroxycholesterol. For NSB ...
Ligand InfoPC cidPC sid
In DepthDetails US Patent