BDBM497918 US11008314, Compound 11
SMILES COc1cc(C)c(Sc2cnc(NC(C)=O)s2)cc1C(=O)N1CCN([C@H](C)C1)C(=O)C=C
InChI Key InChIKey=SHLOWQBVNWTKOE-CQSZACIVSA-N
Data  4 IC50
  Tab Delimited (TSV)   2D SDfile   Computed 3D by Vconf -m prep SDfile
Find this compound or compounds like it in BindingDB:
Activity Spreadsheet -- Enzyme Inhibition Constant Data from BindingDB
Found 4 hits for monomerid = 497918
TargetTyrosine-protein kinase ITK/TSK(Homo sapiens (Human))
Corvus Pharmaceuticals
US Patent
LigandPNGBDBM497918(US11008314, Compound 11)
Affinity DataIC50: <10nM. Assay description: The potency of inhibition is measured by binding affinity.
Ligand InfoPC cidPC sid
In DepthDetails US Patent
TargetTyrosine-protein kinase BTK(Homo sapiens (Human))
Corvus Pharmaceuticals
US Patent
LigandPNGBDBM497918(US11008314, Compound 11)
Affinity DataIC50:  5.50E+3nM. Assay description: The potency of inhibition is measured by binding affinity.
Ligand InfoPC cidPC sid
In DepthDetails US Patent
TargetTyrosine-protein kinase JAK3(Homo sapiens (Human))
Corvus Pharmaceuticals
US Patent
LigandPNGBDBM497918(US11008314, Compound 11)
Affinity DataIC50:  5.50E+3nM. Assay description: The potency of inhibition is measured by binding affinity.
Ligand InfoPC cidPC sid
In DepthDetails US Patent
TargetTyrosine-protein kinase TXK(Homo sapiens (Human))
Corvus Pharmaceuticals
US Patent
LigandPNGBDBM497918(US11008314, Compound 11)
Affinity DataIC50:  550nM. Assay description: The potency of inhibition is measured by binding affinity.
Ligand InfoPC cidPC sid
In DepthDetails US Patent