BDBM497925 US11008314, Compound 17
SMILES COc1cc(C)c(Sc2cnc(NC(=O)C3CC3)s2)cc1C(=O)N1[C@H]2CC[C@@H]1CN(C2)C(=O)C=C
InChI Key InChIKey=KOHRWEWIHNZKPB-CALCHBBNSA-N
Data  4 IC50
  Tab Delimited (TSV)   2D SDfile   Computed 3D by Vconf -m prep SDfile
Find this compound or compounds like it in BindingDB:
Activity Spreadsheet -- Enzyme Inhibition Constant Data from BindingDB
Found 4 hits for monomerid = 497925
TargetTyrosine-protein kinase ITK/TSK(Homo sapiens (Human))
Corvus Pharmaceuticals
US Patent
LigandPNGBDBM497925(US11008314, Compound 17)
Affinity DataIC50: <10nM. Assay description: The potency of inhibition is measured by binding affinity.
Ligand InfoPC cidPC sid
In DepthDetails US Patent
TargetTyrosine-protein kinase BTK(Homo sapiens (Human))
Corvus Pharmaceuticals
US Patent
LigandPNGBDBM497925(US11008314, Compound 17)
Affinity DataIC50: <10nM. Assay description: The potency of inhibition is measured by binding affinity.
Ligand InfoPC cidPC sid
In DepthDetails US Patent
TargetTyrosine-protein kinase JAK3(Homo sapiens (Human))
Corvus Pharmaceuticals
US Patent
LigandPNGBDBM497925(US11008314, Compound 17)
Affinity DataIC50:  55nM. Assay description: The potency of inhibition is measured by binding affinity.
Ligand InfoPC cidPC sid
In DepthDetails US Patent
TargetTyrosine-protein kinase TXK(Homo sapiens (Human))
Corvus Pharmaceuticals
US Patent
LigandPNGBDBM497925(US11008314, Compound 17)
Affinity DataIC50: <10nM. Assay description: The potency of inhibition is measured by binding affinity.
Ligand InfoPC cidPC sid
In DepthDetails US Patent