BDBM497952 US11008314, Compound 42
SMILES CC[C@@H]1CN(CCN1C(=O)C=C)C(=O)c1cc(Sc2cnc(NC(=O)C3CC3)s2)c(C)cc1OC
InChI Key InChIKey=MXOMFNIZCUFFDJ-QGZVFWFLSA-N
Data  4 IC50
  Tab Delimited (TSV)   2D SDfile   Computed 3D by Vconf -m prep SDfile
Find this compound or compounds like it in BindingDB:
Activity Spreadsheet -- Enzyme Inhibition Constant Data from BindingDB
Found 4 hits for monomerid = 497952
TargetTyrosine-protein kinase ITK/TSK(Homo sapiens (Human))
Corvus Pharmaceuticals
US Patent
LigandPNGBDBM497952(US11008314, Compound 42)
Affinity DataIC50: <10nM. Assay description: The potency of inhibition is measured by binding affinity.
Ligand InfoPC cidPC sid
In DepthDetails US Patent
TargetTyrosine-protein kinase BTK(Homo sapiens (Human))
Corvus Pharmaceuticals
US Patent
LigandPNGBDBM497952(US11008314, Compound 42)
Affinity DataIC50:  5.50E+3nM. Assay description: The potency of inhibition is measured by binding affinity.
Ligand InfoPC cidPC sid
In DepthDetails US Patent
TargetTyrosine-protein kinase JAK3(Homo sapiens (Human))
Corvus Pharmaceuticals
US Patent
LigandPNGBDBM497952(US11008314, Compound 42)
Affinity DataIC50:  5.50E+3nM. Assay description: The potency of inhibition is measured by binding affinity.
Ligand InfoPC cidPC sid
In DepthDetails US Patent
TargetTyrosine-protein kinase TXK(Homo sapiens (Human))
Corvus Pharmaceuticals
US Patent
LigandPNGBDBM497952(US11008314, Compound 42)
Affinity DataIC50:  55nM. Assay description: The potency of inhibition is measured by binding affinity.
Ligand InfoPC cidPC sid
In DepthDetails US Patent