BDBM498046 US11008314, Compound 130
SMILES CC[C@@H]1CN(CCN1C(=O)C=C)C(=O)c1cc(Sc2cnc(NC(=O)c3ccsc3)s2)c(C)cc1C
InChI Key InChIKey=ITMSUYHQGVHXBI-LJQANCHMSA-N
Data  4 IC50
  Tab Delimited (TSV)   2D SDfile   Computed 3D by Vconf -m prep SDfile
Find this compound or compounds like it in BindingDB:
Activity Spreadsheet -- Enzyme Inhibition Constant Data from BindingDB
Found 4 hits for monomerid = 498046
TargetTyrosine-protein kinase ITK/TSK(Homo sapiens (Human))
Corvus Pharmaceuticals
US Patent
LigandPNGBDBM498046(US11008314, Compound 130)
Affinity DataIC50: <10nM. Assay description: The potency of inhibition is measured by binding affinity.
Ligand InfoPC cidPC sid
In DepthDetails US Patent
TargetTyrosine-protein kinase BTK(Homo sapiens (Human))
Corvus Pharmaceuticals
US Patent
LigandPNGBDBM498046(US11008314, Compound 130)
Affinity DataIC50:  550nM. Assay description: The potency of inhibition is measured by binding affinity.
Ligand InfoPC cidPC sid
In DepthDetails US Patent
TargetTyrosine-protein kinase JAK3(Homo sapiens (Human))
Corvus Pharmaceuticals
US Patent
LigandPNGBDBM498046(US11008314, Compound 130)
Affinity DataIC50:  550nM. Assay description: The potency of inhibition is measured by binding affinity.
Ligand InfoPC cidPC sid
In DepthDetails US Patent
TargetTyrosine-protein kinase TXK(Homo sapiens (Human))
Corvus Pharmaceuticals
US Patent
LigandPNGBDBM498046(US11008314, Compound 130)
Affinity DataIC50:  55nM. Assay description: The potency of inhibition is measured by binding affinity.
Ligand InfoPC cidPC sid
In DepthDetails US Patent